BDBM50465904 CHEMBL4284764
SMILES [Br-].[Br-].NC(=O)c1cc[n+](CCCC[n+]2ccc(\C=N\O)c(Cl)c2)cc1
InChI Key InChIKey=JBUBUKILSSHXFM-UHFFFAOYSA-P
Data  2 KI
  Tab Delimited (TSV)   2D SDfile   Computed 3D by Vconf -m prep SDfile
Find this compound or compounds like it in BindingDB:
Activity Spreadsheet -- Enzyme Inhibition Constant Data from BindingDB
Found 2 hits for monomerid = 50465904
TargetAcetylcholinesterase(Homo sapiens (Human))
Institute For Medical Research And Occupational Health
Curated by ChEMBL
LigandPNGBDBM50465904(CHEMBL4284764)
Affinity DataKi:  3.60E+4nM. Assay description: Reversible inhibition of recombinant human recombinant AChE using acetylthiocholine iodide as substrate by Ellman spectrophotometric method
Ligand InfoPC cidPC sid
In DepthDetails ArticlePubMed
TargetCholinesterase(Homo sapiens (Human))
Institute For Medical Research And Occupational Health
Curated by ChEMBL
LigandPNGBDBM50465904(CHEMBL4284764)
Affinity DataKi:  2.65E+5nM. Assay description: Reversible inhibition of human plasma BChE using acetylthiocholine iodide as substrate by Ellman spectrophotometric method
Ligand InfoPC cidPC sid
In DepthDetails ArticlePubMed