BDBM50466389 CHEMBL4286196
SMILES CCS(=O)(=O)c1ccc(CC(=O)Nc2ccc(cc2)C(C)(C)C(=O)Nc2ncccc2F)cc1
InChI Key InChIKey=JIHVDVKUIJBBOQ-UHFFFAOYSA-N
Data  2 IC50
  Tab Delimited (TSV)   2D SDfile   Computed 3D by Vconf -m prep SDfile
Find this compound or compounds like it in BindingDB:
Activity Spreadsheet -- Enzyme Inhibition Constant Data from BindingDB
Found 2 hits for monomerid = 50466389
TargetNuclear receptor ROR-gamma(Homo sapiens (Human))
Shionogi
Curated by ChEMBL
LigandPNGBDBM50466389(CHEMBL4286196)
Affinity DataIC50:  310nM. Assay description: Transrepression of recombinant human GAL4-DBD fused RORgammat LBD expressed in HEK293 cells after 20 hrs by luciferase reporter gene assay
Ligand InfoPC cidPC sid
In DepthDetails ArticlePubMed
TargetNuclear receptor ROR-gamma(Mus musculus)
Shionogi
Curated by ChEMBL
LigandPNGBDBM50466389(CHEMBL4286196)
Affinity DataIC50: >1.00E+4nM. Assay description: Transrepression of recombinant mouse GAL4-DBD fused RORgammat LBD expressed in HEK293 cells after 20 hrs by luciferase reporter gene assay
Ligand InfoPC cidPC sid
In DepthDetails ArticlePubMed