BDBM50466533 CHEMBL4292105
SMILES CC[C@H](C)[C@H](N)C(=O)N[C@@H](CCCCN)C(=O)N1CCC[C@H]1C(=O)N[C@@H](CCC(O)=O)C(=O)N[C@@H](C)C(=O)N1CCC[C@H]1C(=O)NCC(=O)N[C@@H](CCC(O)=O)C(=O)N[C@@H](CC(O)=O)C(=O)N[C@@H](C)C(=O)N[C@@H](CO)C(=O)N1CCC[C@H]1C(=O)N[C@@H](CCC(O)=O)C(=O)N[C@@H](CCC(O)=O)C(=O)N[C@@H](CC(C)C)C(=O)N[C@@H](CC(N)=O)C(=O)N[C@@H](CCCNC(N)=N)C(=O)N[C@@H](Cc1ccc(O)cc1)C(=O)N[C@@H](Cc1ccc(O)cc1)C(=O)N[C@@H](C)C(=O)N[C@@H](CO)C(=O)N[C@@H](CC(C)C)C(=O)N[C@@H](CCCNC(N)=N)C(=O)N[C@@H](Cc1cnc[nH]1)C(=O)N[C@@H](Cc1ccc(O)cc1)C(=O)N[C@@H](CC(C)C)C(=O)N[C@@H](CC(N)=O)C(=O)N[C@@H](CC(C)C)C(=O)N[C@@H](C(C)C)C(=O)N[C@@H]([C@@H](C)O)C(=O)N[C@@H](CCCNC(N)=N)C(=O)N[C@@H](CCC(N)=O)C(=O)N[C@@H](CCCNC(N)=N)C(=O)N[C@@H](Cc1ccc(O)cc1)C(O)=O
InChI Key InChIKey=AOHBOXXHKFELOK-DQNUUZSMSA-N
Data  8 KI  12 EC50
  Tab Delimited (TSV)   2D SDfile   Computed 3D by Vconf -m prep SDfile
Find this compound or compounds like it in BindingDB:
Activity Spreadsheet -- Enzyme Inhibition Constant Data from BindingDB
Found 20 hits for monomerid = 50466533
TargetNeuropeptide Y receptor type 2(Homo sapiens (Human))
TBA
Curated by ChEMBL
LigandPNGBDBM50466533(CHEMBL4292105)
Affinity DataKi:  0.398nM. Assay description: Displacement of [125I]-PYY(1 to 36 residues) from human Y2R expressed in CHO cell membranes after 2 hrs by scintillation proximity assay
Ligand InfoPC cidPC sid
In DepthDetails ArticlePubMed
TargetNeuropeptide Y receptor type 2(Homo sapiens (Human))
TBA
Curated by ChEMBL
LigandPNGBDBM50466533(CHEMBL4292105)
Affinity DataKi:  0.400nM. Assay description: Displacement of [125I]-PYY(1 to 36 residues) from human Y2R expressed in CHO cell membranes after 2 hrs by scintillation proximity assay
Ligand InfoPC cidPC sid
In DepthDetails ArticlePubMed
TargetNeuropeptide Y receptor type 5(Homo sapiens (Human))
TBA
Curated by ChEMBL
LigandPNGBDBM50466533(CHEMBL4292105)
Affinity DataKi:  3.20nM. Assay description: Displacement of [125I]-PYY(1 to 36 residues) from human Y5R expressed in HEK293 cell membranes after 2 hrs by scintillation proximity assay
Ligand InfoPC cidPC sid
In DepthDetails ArticlePubMed
TargetNeuropeptide Y receptor type 5(Homo sapiens (Human))
TBA
Curated by ChEMBL
LigandPNGBDBM50466533(CHEMBL4292105)
Affinity DataKi:  3.20nM. Assay description: Displacement of [125I]-PYY(1 to 36 residues) from human Y5R expressed in HEK293 cell membranes after 2 hrs by scintillation proximity assay
Ligand InfoPC cidPC sid
In DepthDetails ArticlePubMed
TargetNeuropeptide Y receptor type 4(Homo sapiens (Human))
TBA
Curated by ChEMBL
LigandPNGBDBM50466533(CHEMBL4292105)
Affinity DataKi:  13nM. Assay description: Displacement of [125I]-PP from human Y4R expressed in CHO-K1 cell membranes after 2 hrs by scintillation proximity assay
Ligand InfoPC cidPC sid
In DepthDetails ArticlePubMed
TargetNeuropeptide Y receptor type 4(Homo sapiens (Human))
TBA
Curated by ChEMBL
LigandPNGBDBM50466533(CHEMBL4292105)
Affinity DataKi:  13nM. Assay description: Displacement of [125I]-PP from human Y4R expressed in CHO-K1 cell membranes after 2 hrs by scintillation proximity assay
Ligand InfoPC cidPC sid
In DepthDetails ArticlePubMed
TargetNeuropeptide Y receptor type 1(Homo sapiens (Human))
TBA
Curated by ChEMBL
LigandPNGBDBM50466533(CHEMBL4292105)
Affinity DataKi:  40nM. Assay description: Displacement of [125I]-PYY(1 to 36 residues) from human Y1R expressed in BHK-21 cell membranes after 2 hrs by scintillation proximity assay
Ligand InfoPC cidPC sid
In DepthDetails ArticlePubMed
TargetNeuropeptide Y receptor type 1(Homo sapiens (Human))
TBA
Curated by ChEMBL
LigandPNGBDBM50466533(CHEMBL4292105)
Affinity DataKi:  40nM. Assay description: Displacement of [125I]-PYY(1 to 36 residues) from human Y1R expressed in BHK-21 cell membranes after 2 hrs by scintillation proximity assay
Ligand InfoPC cidPC sid
In DepthDetails ArticlePubMed
TargetNeuropeptide Y receptor type 4(Mus musculus)
TBA
Curated by ChEMBL
LigandPNGBDBM50466533(CHEMBL4292105)
Affinity DataEC50: >1.00E+3nM. Assay description: Displacement of [125I]-PYY(1 to 36 residues) from mouse Y4R expressed in HEK293 cell membranes after 2 hrs by scintillation proximity assay
Ligand InfoPC cidPC sid
In DepthDetails ArticlePubMed
TargetNeuropeptide Y receptor type 4(Homo sapiens (Human))
TBA
Curated by ChEMBL
LigandPNGBDBM50466533(CHEMBL4292105)
Affinity DataEC50: <32nM. Assay description: Activation of human Y4R expressed in HEK293 cells assessed as inhibition of isoproterenol-induced increase in intracellular cAMP levels by calcium 5 ...
Ligand InfoPC cidPC sid
In DepthDetails ArticlePubMed
TargetNeuropeptide Y receptor type 2(Homo sapiens (Human))
TBA
Curated by ChEMBL
LigandPNGBDBM50466533(CHEMBL4292105)
Affinity DataEC50:  1nM. Assay description: Activation of human Y2R expressed in HEK293 cells assessed as inhibition of isoproterenol-induced increase in intracellular cAMP levels by calcium 5 ...
Ligand InfoPC cidPC sid
In DepthDetails ArticlePubMed
TargetNeuropeptide Y receptor type 2(Homo sapiens (Human))
TBA
Curated by ChEMBL
LigandPNGBDBM50466533(CHEMBL4292105)
Affinity DataEC50:  1nM. Assay description: Activation of human Y2R expressed in HEK293 cells assessed as inhibition of isoproterenol-induced increase in intracellular cAMP levels by calcium 5 ...
Ligand InfoPC cidPC sid
In DepthDetails ArticlePubMed
TargetNeuropeptide Y receptor type 5(Homo sapiens (Human))
TBA
Curated by ChEMBL
LigandPNGBDBM50466533(CHEMBL4292105)
Affinity DataEC50:  7.90nM. Assay description: Activation of human Y5R expressed in HEK293 cells assessed as inhibition of isoproterenol-induced increase in intracellular cAMP levels by calcium 5 ...
Ligand InfoPC cidPC sid
In DepthDetails ArticlePubMed
TargetNeuropeptide Y receptor type 4(Homo sapiens (Human))
TBA
Curated by ChEMBL
LigandPNGBDBM50466533(CHEMBL4292105)
Affinity DataEC50: >30nM. Assay description: Activation of human Y4R expressed in HEK293 cells assessed as inhibition of isoproterenol-induced increase in intracellular cAMP levels by calcium 5 ...
Ligand InfoPC cidPC sid
In DepthDetails ArticlePubMed
TargetNeuropeptide Y receptor type 4(Mus musculus)
TBA
Curated by ChEMBL
LigandPNGBDBM50466533(CHEMBL4292105)
Affinity DataEC50: <1.00E+3nM. Assay description: Displacement of [125I]-PYY(1 to 36 residues) from mouse Y4R expressed in HEK293 cell membranes after 2 hrs by scintillation proximity assay
Ligand InfoPC cidPC sid
In DepthDetails ArticlePubMed
TargetNeuropeptide Y receptor type 1(Homo sapiens (Human))
TBA
Curated by ChEMBL
LigandPNGBDBM50466533(CHEMBL4292105)
Affinity DataEC50:  16nM. Assay description: Activation of human Y1R expressed in HEK293 cells assessed as inhibition of isoproterenol-induced increase in intracellular cAMP levels by calcium 5 ...
Ligand InfoPC cidPC sid
In DepthDetails ArticlePubMed
TargetNeuropeptide Y receptor type 5(Mus musculus (Mouse))
TBA
Curated by ChEMBL
LigandPNGBDBM50466533(CHEMBL4292105)
Affinity DataEC50:  25nM. Assay description: Displacement of [125I]-PYY(1 to 36 residues) from mouse Y5R expressed in HEK293 cell membranes after 2 hrs by scintillation proximity assay
Ligand InfoPC cidPC sid
In DepthDetails ArticlePubMed
TargetNeuropeptide Y receptor type 5(Homo sapiens (Human))
TBA
Curated by ChEMBL
LigandPNGBDBM50466533(CHEMBL4292105)
Affinity DataEC50:  7.90nM. Assay description: Activation of human Y5R expressed in HEK293 cells assessed as inhibition of isoproterenol-induced increase in intracellular cAMP levels by calcium 5 ...
Ligand InfoPC cidPC sid
In DepthDetails ArticlePubMed
TargetNeuropeptide Y receptor type 5(Mus musculus (Mouse))
TBA
Curated by ChEMBL
LigandPNGBDBM50466533(CHEMBL4292105)
Affinity DataEC50:  25nM. Assay description: Displacement of [125I]-PYY(1 to 36 residues) from mouse Y5R expressed in HEK293 cell membranes after 2 hrs by scintillation proximity assay
Ligand InfoPC cidPC sid
In DepthDetails ArticlePubMed
TargetNeuropeptide Y receptor type 1(Homo sapiens (Human))
TBA
Curated by ChEMBL
LigandPNGBDBM50466533(CHEMBL4292105)
Affinity DataEC50:  16nM. Assay description: Activation of human Y1R expressed in HEK293 cells assessed as inhibition of isoproterenol-induced increase in intracellular cAMP levels by calcium 5 ...
Ligand InfoPC cidPC sid
In DepthDetails ArticlePubMed