BDBM50466538 CHEMBL4284905
SMILES CC[C@H](C)[C@H](NC(=O)[C@H](Cc1ccc(O)cc1)NC(=O)[C@H](Cc1cnc[nH]1)NC(=O)[C@H](CCCNC(N)=N)NC(=O)[C@H](CC(C)C)NC(=O)[C@H](CO)NC(=O)[C@H](C)NC(=O)[C@H](Cc1ccc(O)cc1)NC(=O)[C@H](Cc1ccc(O)cc1)NC(=O)[C@H](CCCNC(N)=N)NC(=O)[C@H](C)NC(=O)[C@H](CCSC)NC(=O)[C@H](CC(O)=O)NC(=O)[C@H](CCC(O)=O)NC(=O)[C@H](C)NC(=O)[C@@H]1CCCN1C(=O)[C@H](C)NC(=O)[C@H](CC(O)=O)NC(=O)[C@H](CCC(O)=O)NC(=O)CNC(=O)[C@@H]1CCCN1C(=O)[C@H](CC(N)=O)NC(=O)[C@H](CC(O)=O)NC(=O)[C@@H]1CCCN1C(=O)[C@H](CCCCN)NC(=O)[C@H](CO)NC(=O)[C@@H]1CCCN1C(=O)[C@@H](N)Cc1ccc(O)cc1)C(=O)N[C@@H](CC(N)=O)C(=O)N[C@@H](CC(C)C)C(=O)N[C@@H]([C@@H](C)CC)C(=O)N[C@@H]([C@@H](C)O)C(=O)N[C@@H](CCCNC(N)=N)C(=O)N[C@@H](CCC(N)=O)C(=O)N[C@@H](CCCNC(N)=N)C(=O)N[C@@H](Cc1ccc(O)cc1)C(O)=O
InChI Key InChIKey=XSGYAONDLYPQGB-HRPSIEBRSA-N
Data  8 KI  8 EC50
  Tab Delimited (TSV)   2D SDfile   Computed 3D by Vconf -m prep SDfile
Find this compound or compounds like it in BindingDB:
Activity Spreadsheet -- Enzyme Inhibition Constant Data from BindingDB
Found 16 hits for monomerid = 50466538
TargetNeuropeptide Y receptor type 1(Homo sapiens (Human))
TBA
Curated by ChEMBL
LigandPNGBDBM50466538(CHEMBL4284905)
Affinity DataKi:  0.25nM. Assay description: Displacement of [125I]-PYY(1 to 36 residues) from human Y1R expressed in BHK-21 cell membranes after 2 hrs by scintillation proximity assay
Ligand InfoPC cidPC sid
In DepthDetails ArticlePubMed
TargetNeuropeptide Y receptor type 1(Homo sapiens (Human))
TBA
Curated by ChEMBL
LigandPNGBDBM50466538(CHEMBL4284905)
Affinity DataKi:  0.251nM. Assay description: Displacement of [125I]-PYY(1 to 36 residues) from human Y1R expressed in BHK-21 cell membranes after 2 hrs by scintillation proximity assay
Ligand InfoPC cidPC sid
In DepthDetails ArticlePubMed
TargetNeuropeptide Y receptor type 5(Homo sapiens (Human))
TBA
Curated by ChEMBL
LigandPNGBDBM50466538(CHEMBL4284905)
Affinity DataKi:  0.398nM. Assay description: Displacement of [125I]-PYY(1 to 36 residues) from human Y5R expressed in HEK293 cell membranes after 2 hrs by scintillation proximity assay
Ligand InfoPC cidPC sid
In DepthDetails ArticlePubMed
TargetNeuropeptide Y receptor type 5(Homo sapiens (Human))
TBA
Curated by ChEMBL
LigandPNGBDBM50466538(CHEMBL4284905)
Affinity DataKi:  0.400nM. Assay description: Displacement of [125I]-PYY(1 to 36 residues) from human Y5R expressed in HEK293 cell membranes after 2 hrs by scintillation proximity assay
Ligand InfoPC cidPC sid
In DepthDetails ArticlePubMed
TargetNeuropeptide Y receptor type 2(Homo sapiens (Human))
TBA
Curated by ChEMBL
LigandPNGBDBM50466538(CHEMBL4284905)
Affinity DataKi:  0.790nM. Assay description: Displacement of [125I]-PYY(1 to 36 residues) from human Y2R expressed in CHO cell membranes after 2 hrs by scintillation proximity assay
Ligand InfoPC cidPC sid
In DepthDetails ArticlePubMed
TargetNeuropeptide Y receptor type 2(Homo sapiens (Human))
TBA
Curated by ChEMBL
LigandPNGBDBM50466538(CHEMBL4284905)
Affinity DataKi:  0.794nM. Assay description: Displacement of [125I]-PYY(1 to 36 residues) from human Y2R expressed in CHO cell membranes after 2 hrs by scintillation proximity assay
Ligand InfoPC cidPC sid
In DepthDetails ArticlePubMed
TargetNeuropeptide Y receptor type 4(Homo sapiens (Human))
TBA
Curated by ChEMBL
LigandPNGBDBM50466538(CHEMBL4284905)
Affinity DataKi:  2.5nM. Assay description: Displacement of [125I]-PP from human Y4R expressed in CHO-K1 cell membranes after 2 hrs by scintillation proximity assay
Ligand InfoPC cidPC sid
In DepthDetails ArticlePubMed
TargetNeuropeptide Y receptor type 4(Homo sapiens (Human))
TBA
Curated by ChEMBL
LigandPNGBDBM50466538(CHEMBL4284905)
Affinity DataKi:  2.5nM. Assay description: Displacement of [125I]-PP from human Y4R expressed in CHO-K1 cell membranes after 2 hrs by scintillation proximity assay
Ligand InfoPC cidPC sid
In DepthDetails ArticlePubMed
TargetNeuropeptide Y receptor type 1(Homo sapiens (Human))
TBA
Curated by ChEMBL
LigandPNGBDBM50466538(CHEMBL4284905)
Affinity DataEC50:  0.200nM. Assay description: Activation of human Y1R expressed in HEK293 cells assessed as inhibition of isoproterenol-induced increase in intracellular cAMP levels by calcium 5 ...
Ligand InfoPC cidPC sid
In DepthDetails ArticlePubMed
TargetNeuropeptide Y receptor type 2(Homo sapiens (Human))
TBA
Curated by ChEMBL
LigandPNGBDBM50466538(CHEMBL4284905)
Affinity DataEC50:  2nM. Assay description: Activation of human Y2R expressed in HEK293 cells assessed as inhibition of isoproterenol-induced increase in intracellular cAMP levels by calcium 5 ...
Ligand InfoPC cidPC sid
In DepthDetails ArticlePubMed
TargetNeuropeptide Y receptor type 2(Homo sapiens (Human))
TBA
Curated by ChEMBL
LigandPNGBDBM50466538(CHEMBL4284905)
Affinity DataEC50:  2nM. Assay description: Activation of human Y2R expressed in HEK293 cells assessed as inhibition of isoproterenol-induced increase in intracellular cAMP levels by calcium 5 ...
Ligand InfoPC cidPC sid
In DepthDetails ArticlePubMed
TargetNeuropeptide Y receptor type 5(Homo sapiens (Human))
TBA
Curated by ChEMBL
LigandPNGBDBM50466538(CHEMBL4284905)
Affinity DataEC50:  2.5nM. Assay description: Activation of human Y5R expressed in HEK293 cells assessed as inhibition of isoproterenol-induced increase in intracellular cAMP levels by calcium 5 ...
Ligand InfoPC cidPC sid
In DepthDetails ArticlePubMed
TargetNeuropeptide Y receptor type 5(Homo sapiens (Human))
TBA
Curated by ChEMBL
LigandPNGBDBM50466538(CHEMBL4284905)
Affinity DataEC50:  2.5nM. Assay description: Activation of human Y5R expressed in HEK293 cells assessed as inhibition of isoproterenol-induced increase in intracellular cAMP levels by calcium 5 ...
Ligand InfoPC cidPC sid
In DepthDetails ArticlePubMed
TargetNeuropeptide Y receptor type 1(Homo sapiens (Human))
TBA
Curated by ChEMBL
LigandPNGBDBM50466538(CHEMBL4284905)
Affinity DataEC50:  0.200nM. Assay description: Activation of human Y1R expressed in HEK293 cells assessed as inhibition of isoproterenol-induced increase in intracellular cAMP levels by calcium 5 ...
Ligand InfoPC cidPC sid
In DepthDetails ArticlePubMed
TargetNeuropeptide Y receptor type 4(Homo sapiens (Human))
TBA
Curated by ChEMBL
LigandPNGBDBM50466538(CHEMBL4284905)
Affinity DataEC50:  10nM. Assay description: Activation of human Y4R expressed in HEK293 cells assessed as inhibition of isoproterenol-induced increase in intracellular cAMP levels by calcium 5 ...
Ligand InfoPC cidPC sid
In DepthDetails ArticlePubMed
TargetNeuropeptide Y receptor type 4(Homo sapiens (Human))
TBA
Curated by ChEMBL
LigandPNGBDBM50466538(CHEMBL4284905)
Affinity DataEC50:  10nM. Assay description: Activation of human Y4R expressed in HEK293 cells assessed as inhibition of isoproterenol-induced increase in intracellular cAMP levels by calcium 5 ...
Ligand InfoPC cidPC sid
In DepthDetails ArticlePubMed