BDBM50467825 CHEMBL4289564
SMILES Oc1cccc(\C=C2/NS(=O)(=O)c3ccccc3C2=O)c1
InChI Key InChIKey=SOUJRYLSJKODRT-LCYFTJDESA-N
Data  2 IC50
  Tab Delimited (TSV)   2D SDfile   Computed 3D by Vconf -m prep SDfile
Find this compound or compounds like it in BindingDB:
Activity Spreadsheet -- Enzyme Inhibition Constant Data from BindingDB
Found 2 hits for monomerid = 50467825
TargetIntestinal-type alkaline phosphatase(Homo sapiens (Human))
University Of Auckland
Curated by ChEMBL
LigandPNGBDBM50467825(CHEMBL4289564)
Affinity DataIC50:  1.21E+3nM. Assay description: Inhibition of human IAP expressed in African green monkey COS7 cell membranes using CDP-star as substrate pretreated for 5 to 10 mins followed by sub...
In DepthDetails ArticlePubMed
TargetAlkaline phosphatase, tissue-nonspecific isozyme(Homo sapiens (Human))
University Of Auckland
Curated by ChEMBL
LigandPNGBDBM50467825(CHEMBL4289564)
Affinity DataIC50:  3.57E+3nM. Assay description: Inhibition of human TNAP expressed in African green monkey COS7 cell membranes using CDP-star as substrate pretreated for 5 to 10 mins followed by su...
In DepthDetails ArticlePubMed