BDBM50467832 CHEMBL4276768
SMILES Fc1cccc(F)c1\C=C1/NS(=O)(=O)c2ccccc2C1=O
InChI Key InChIKey=LUBNLPFKCDGTCX-JYRVWZFOSA-N
Data  2 IC50
  Tab Delimited (TSV)   2D SDfile   Computed 3D by Vconf -m prep SDfile
Find this compound or compounds like it in BindingDB:
Activity Spreadsheet -- Enzyme Inhibition Constant Data from BindingDB
Found 2 hits for monomerid = 50467832
TargetIntestinal-type alkaline phosphatase(Homo sapiens (Human))
University Of Auckland
Curated by ChEMBL
LigandPNGBDBM50467832(CHEMBL4276768)
Affinity DataIC50:  1.06E+4nM. Assay description: Inhibition of human IAP expressed in African green monkey COS7 cell membranes using CDP-star as substrate pretreated for 5 to 10 mins followed by sub...
Ligand InfoPC cidPC sid
In DepthDetails ArticlePubMed
TargetAlkaline phosphatase, tissue-nonspecific isozyme(Homo sapiens (Human))
University Of Auckland
Curated by ChEMBL
LigandPNGBDBM50467832(CHEMBL4276768)
Affinity DataIC50:  1.53E+3nM. Assay description: Inhibition of human TNAP expressed in African green monkey COS7 cell membranes using CDP-star as substrate pretreated for 5 to 10 mins followed by su...
Ligand InfoPC cidPC sid
In DepthDetails ArticlePubMed