BDBM50468091 CHEMBL4277733
SMILES Oc1c(Br)cc(Br)cc1C(=O)Nc1ccc(Sc2nc3ccccc3s2)cc1
InChI Key InChIKey=IUQCCIKCYKEUBD-UHFFFAOYSA-N
Data  8 IC50
  Tab Delimited (TSV)   2D SDfile   Computed 3D by Vconf -m prep SDfile
Find this compound or compounds like it in BindingDB:
Activity Spreadsheet -- Enzyme Inhibition Constant Data from BindingDB
Found 8 hits for monomerid = 50468091
TargetCo-chaperonin GroES(Escherichia coli)
Indiana University School Of Medicine
Curated by ChEMBL
LigandPNGBDBM50468091(CHEMBL4277733)
Affinity DataIC50:  1.30E+3nM. Assay description: Inhibition of Escherichia coli GroEL expressed in Escherichia coli DH5alpha/Escherichia coli GroES expressed in Escherichia coli BL21 (DE3) assessed ...
Ligand InfoPC cidPC sid
In DepthDetails ArticlePubMed
TargetThiosulfate sulfurtransferase(Homo sapiens)
Indiana University School Of Medicine
Curated by ChEMBL
LigandPNGBDBM50468091(CHEMBL4277733)
Affinity DataIC50: >1.00E+5nM. Assay description: Inhibition of refolded rhodanese (unknown origin) preincubated with Escherichia coli GroEL/GroES for 60 mins in absence of compound followed by compo...
Ligand InfoPC cidPC sid
In DepthDetails ArticlePubMed
TargetCo-chaperonin GroES(Escherichia coli)
Indiana University School Of Medicine
Curated by ChEMBL
LigandPNGBDBM50468091(CHEMBL4277733)
Affinity DataIC50:  2.70E+3nM. Assay description: Inhibition of Escherichia coli GroEL expressed in Escherichia coli DH5alpha/Escherichia coli GroES expressed in Escherichia coli BL21 (DE3) assessed ...
Ligand InfoPC cidPC sid
In DepthDetails ArticlePubMed
TargetThiosulfate sulfurtransferase(Homo sapiens)
Indiana University School Of Medicine
Curated by ChEMBL
LigandPNGBDBM50468091(CHEMBL4277733)
Affinity DataIC50: >1.00E+5nM. Assay description: Inhibition of refolded Rhodanese (unknown origin)-mediated conversion of cyanide to thiocyanate treated with compound after refolding of the denature...
Ligand InfoPC cidPC sid
In DepthDetails ArticlePubMed
TargetCo-chaperonin GroES(Escherichia coli)
Indiana University School Of Medicine
Curated by ChEMBL
LigandPNGBDBM50468091(CHEMBL4277733)
Affinity DataIC50:  3.20E+3nM. Assay description: Inhibition of Escherichia coli GroEL/ES-mediated refolding of the denatured malate dehydrogenase
Ligand InfoPC cidPC sid
In DepthDetails ArticlePubMed
TargetCo-chaperonin GroES(Escherichia coli)
Indiana University School Of Medicine
Curated by ChEMBL
LigandPNGBDBM50468091(CHEMBL4277733)
Affinity DataIC50:  2.20E+3nM. Assay description: Inhibition of Escherichia coli GroEL/ES-mediated refolding of the denatured rhodanese
Ligand InfoPC cidPC sid
In DepthDetails ArticlePubMed
Target60 kDa heat shock protein, mitochondrial(Homo sapiens)
Indiana University School Of Medicine
Curated by ChEMBL
LigandPNGBDBM50468091(CHEMBL4277733)
Affinity DataIC50:  5.90E+3nM. Assay description: Inhibition of human mitochondrial HSP60/10-mediated refolding of the denatured malate dehydrogenase
Ligand InfoPC cidPC sid
In DepthDetails ArticlePubMed
Target60 kDa heat shock protein, mitochondrial(Homo sapiens)
Indiana University School Of Medicine
Curated by ChEMBL
LigandPNGBDBM50468091(CHEMBL4277733)
Affinity DataIC50:  4.70E+3nM. Assay description: Inhibition of human N-terminal octa-His-tagged HSP60 expressed in Escherichia coli Rosetta(DE3) pLysS/human HSP10 expressed in Escherichia coli Roset...
Ligand InfoPC cidPC sid
In DepthDetails ArticlePubMed