BDBM50469143 CHEMBL4293677
SMILES [#7]S(=O)(=O)c1ccc(cc1)-c1ncc([se;v2]1)-c1ccccc1
InChI Key InChIKey=FMNYHPPTHRSLST-UHFFFAOYSA-N
Data  6 KI
  Tab Delimited (TSV)   2D SDfile   Computed 3D by Vconf -m prep SDfile
Find this compound or compounds like it in BindingDB:
Activity Spreadsheet -- Enzyme Inhibition Constant Data from BindingDB
Found 6 hits for monomerid = 50469143
TargetCarbonic anhydrase 9(Homo sapiens (Human))
Department Of University Of Florence
Curated by ChEMBL
LigandPNGBDBM50469143(CHEMBL4293677)
Affinity DataKi:  6.5nM. Assay description: Inhibition of recombinant human carbonic anhydrase 9 incubated for 15 mins prior to testing by stopped flow CO2 hydration assay
Ligand InfoPC cidPC sid
In DepthDetails ArticlePubMed
TargetCarbonic anhydrase 5A, mitochondrial(Homo sapiens (Human))
Department Of University Of Florence
Curated by ChEMBL
LigandPNGBDBM50469143(CHEMBL4293677)
Affinity DataKi:  9.70nM. Assay description: Inhibition of recombinant human carbonic anhydrase 5a incubated for 15 mins prior to testing by stopped flow CO2 hydration assay
Ligand InfoPC cidPC sid
In DepthDetails ArticlePubMed
TargetCarbonic anhydrase 2(Homo sapiens (Human))
Department Of University Of Florence
Curated by ChEMBL
LigandPNGBDBM50469143(CHEMBL4293677)
Affinity DataKi:  30nM. Assay description: Inhibition of recombinant human carbonic anhydrase 2 incubated for 15 mins prior to testing by stopped flow CO2 hydration assay
Ligand InfoPC cidPC sid
In DepthDetails ArticlePubMed
TargetCarbonic anhydrase 1(Homo sapiens (Human))
Department Of University Of Florence
Curated by ChEMBL
LigandPNGBDBM50469143(CHEMBL4293677)
Affinity DataKi:  34nM. Assay description: Inhibition of recombinant human carbonic anhydrase 1 incubated for 15 mins prior to testing by stopped flow CO2 hydration assay
Ligand InfoPC cidPC sid
In DepthDetails ArticlePubMed
TargetCarbonic anhydrase 4(Homo sapiens (Human))
Department Of University Of Florence
Curated by ChEMBL
LigandPNGBDBM50469143(CHEMBL4293677)
Affinity DataKi:  652nM. Assay description: Inhibition of recombinant human carbonic anhydrase 4 incubated for 15 mins prior to testing by stopped flow CO2 hydration assay
Ligand InfoPC cidPC sid
In DepthDetails ArticlePubMed
TargetCarbonic anhydrase 5B, mitochondrial(Homo sapiens (Human))
Department Of University Of Florence
Curated by ChEMBL
LigandPNGBDBM50469143(CHEMBL4293677)
Affinity DataKi:  703nM. Assay description: Inhibition of recombinant human carbonic anhydrase 5b incubated for 15 mins prior to testing by stopped flow CO2 hydration assay
Ligand InfoPC cidPC sid
In DepthDetails ArticlePubMed