BDBM50469638 NAPITANE
SMILES C([C@@H]1CCCc2c3OCOc3ccc12)N1CC[C@@H](C1)c1ccccc1
InChI Key InChIKey=HAEPGZUGYMHCJE-ROUUACIJSA-N
Data  2 KI
  Tab Delimited (TSV)   2D SDfile   Computed 3D by Vconf -m prep SDfile
Find this compound or compounds like it in BindingDB:
Activity Spreadsheet -- Enzyme Inhibition Constant Data from BindingDB
Found 2 hits for monomerid = 50469638
LigandPNGBDBM50469638(NAPITANE)
Affinity DataKi:  0.428nM. Assay description: In vitro binding affinity at Alpha-2 adrenergic receptor in rat cortex by radioligand binding assay using [3H]rauwolscine
In DepthDetails Article
TargetAlpha-1A/Alpha-1B/Alpha-1D adrenergic receptor(Rattus norvegicus (rat))TBA
LigandPNGBDBM50469638(NAPITANE)
Affinity DataKi:  106nM. Assay description: In vitro binding affinity at Alpha-1 adrenergic receptor by radioligand binding assay using [3H]prazosin
In DepthDetails Article