BDBM50469749 CHEMBL349069::Ro-092127
SMILES CCc1ccc(CC[C@@H]2CCC(C)(C)[C@H](OC)[C@H]2Cn2ccnc2)cc1
InChI Key InChIKey=LTTNGEQHWMFQKH-BHIFYINESA-N
Data  1 IC50
  Tab Delimited (TSV)   2D SDfile   Computed 3D by Vconf -m prep SDfile
Find this compound or compounds like it in BindingDB:
Activity Spreadsheet -- Enzyme Inhibition Constant Data from BindingDB
Found 1 hit for monomerid = 50469749
TargetLanosterol 14-alpha demethylase(Homo sapiens (Human))TBA
LigandPNGBDBM50469749(CHEMBL349069 | Ro-092127)
Affinity DataIC50:  90.3nM. Assay description: In vitro inhibition of Lanosterol 14-alpha demethylase (Candida albicans CY1005)
Ligand InfoPC cidPC sid
In DepthDetails Article