BDBM50470046 CHEMBL126869
SMILES [H][C@@]12CC(CO)=CC[C@@]1([H])C(C)(C)Oc1cc(cc(CC)c21)C(C)(C)CCCCCCN=C=S
InChI Key InChIKey=ZWSFJJNCYUPGKF-DNQXCXABSA-N
Data  1 IC50
  Tab Delimited (TSV)   2D SDfile   Computed 3D by Vconf -m prep SDfile
Find this compound or compounds like it in BindingDB:
Activity Spreadsheet -- Enzyme Inhibition Constant Data from BindingDB
Found 1 hit for monomerid = 50470046
TargetCannabinoid receptor 1/2(Rattus norvegicus (Rat))
University Of Connecticut
Curated by ChEMBL
LigandPNGBDBM50470046(CHEMBL126869)
Affinity DataIC50:  1.60nM. Assay description: Tested for affinity of compound against cannabinoid receptor in rat forebrain membranes
Ligand InfoPC cidPC sid
In DepthDetails ArticlePubMed