BDBM50470328 CHEMBL317300
SMILES CCCCc1nc(cn1Cc1ccc(cc1)-c1ccccc1-c1nn[nH]n1)-c1nc(C)c[n+]([O-])c1C
InChI Key InChIKey=KVGLEKDVYFQJPF-UHFFFAOYSA-N
Data  1 KI
  Tab Delimited (TSV)   2D SDfile   Computed 3D by Vconf -m prep SDfile
Find this compound or compounds like it in BindingDB:
Activity Spreadsheet -- Enzyme Inhibition Constant Data from BindingDB
Found 1 hit for monomerid = 50470328
TargetType-1 angiotensin II receptor A/B(RAT)
Laboratori Guidotti
Curated by ChEMBL
LigandPNGBDBM50470328(CHEMBL317300)
Affinity DataKi:  4.40nM. Assay description: Inhibition of [3H]angiotensin II binding to rat adrenal cortex membrane containing angiotensin II receptor, type 1
Ligand InfoPC cidPC sid
In DepthDetails ArticlePubMed