BDBM50470678 CHEMBL146885
SMILES COc1ccc(cc1CN[C@H]1CCCN[C@H]1c1ccccc1)-c1c(C)noc1C
InChI Key InChIKey=NNCLFEXCOZZGBL-URXFXBBRSA-N
Data  1 KI
  Tab Delimited (TSV)   2D SDfile   Computed 3D by Vconf -m prep SDfile
Find this compound or compounds like it in BindingDB:
Activity Spreadsheet -- Enzyme Inhibition Constant Data from BindingDB
Found 1 hit for monomerid = 50470678
TargetSubstance-P receptor(Homo sapiens (Human))
Gsk
Curated by ChEMBL
LigandPNGBDBM50470678(CHEMBL146885)
Affinity DataKi:  0.0501nM. Assay description: Binding affinity to Tachykinin receptor 1 stably expressed in chinese hamster ovary (CHO) cells
Ligand InfoPC cidPC sid
In DepthDetails ArticlePubMed