BDBM50471566 CHEMBL11911
SMILES CCOCCn1c(COc2ccc(\C=C\C(=O)c3ccc(cc3O)C(O)=O)cc2)nc2ccccc12
InChI Key InChIKey=QSXKFMBAFURSGT-NTEUORMPSA-N
Data  1 Kd
  Tab Delimited (TSV)   2D SDfile   Computed 3D by Vconf -m prep SDfile
Find this compound or compounds like it in BindingDB:
Activity Spreadsheet -- Enzyme Inhibition Constant Data from BindingDB
Found 1 hit for monomerid = 50471566
TargetCysteinyl leukotriene receptor 1/2(Homo sapiens (Human))
Vrije Universiteit
Curated by ChEMBL
LigandPNGBDBM50471566(CHEMBL11911)
Affinity DataKd:  6.24E+4nM. Assay description: Displacement of [3H]LTD4 from Cysteinyl leukotriene D4 receptor in guinea pig lung membranes
Ligand InfoPC cidPC sid
In DepthDetails ArticlePubMed