BDBM50471567 CHEMBL11822
SMILES OC(=O)c1ccc(C(=O)\C=C\c2ccc(OCc3ccc4ccccc4n3)cc2)c(O)c1
InChI Key InChIKey=INKDYYTXFGMQMZ-VGOFMYFVSA-N
Data  1 Kd
  Tab Delimited (TSV)   2D SDfile   Computed 3D by Vconf -m prep SDfile
Find this compound or compounds like it in BindingDB:
Activity Spreadsheet -- Enzyme Inhibition Constant Data from BindingDB
Found 1 hit for monomerid = 50471567
TargetCysteinyl leukotriene receptor 1/2(Homo sapiens (Human))
Vrije Universiteit
Curated by ChEMBL
LigandPNGBDBM50471567(CHEMBL11822)
Affinity DataKd:  1.21E+3nM. Assay description: Displacement of [3H]LTD4 from Cysteinyl leukotriene D4 receptor in guinea pig lung membranes
Ligand InfoPC cidPC sid
In DepthDetails ArticlePubMed