BDBM50471573 CHEMBL11508
SMILES OC(=O)c1cccc(C(=O)\C=C\c2cccc(\C=C\c3ccc4ccccc4n3)c2)c1O
InChI Key InChIKey=HXALHRWESQWBPV-MHMBTURYSA-N
Data  1 Kd
  Tab Delimited (TSV)   2D SDfile   Computed 3D by Vconf -m prep SDfile
Find this compound or compounds like it in BindingDB:
Activity Spreadsheet -- Enzyme Inhibition Constant Data from BindingDB
Found 1 hit for monomerid = 50471573
TargetCysteinyl leukotriene receptor 1/2(Homo sapiens (Human))
Vrije Universiteit
Curated by ChEMBL
LigandPNGBDBM50471573(CHEMBL11508)
Affinity DataKd:  26nM. Assay description: Displacement of [3H]LTD4 from Cysteinyl leukotriene D4 receptor in guinea pig lung membranes
Ligand InfoPC cidPC sid
In DepthDetails ArticlePubMed