BDBM50471576 CHEMBL11532
SMILES COC(=O)c1ccc(OC)c(c1)C(=O)\C=C\c1ccc(OCc2ccc3ccccc3n2)cc1
InChI Key InChIKey=JXDQWYZHYXKUMS-OQLLNIDSSA-N
Data  1 Kd
  Tab Delimited (TSV)   2D SDfile   Computed 3D by Vconf -m prep SDfile
Find this compound or compounds like it in BindingDB:
Activity Spreadsheet -- Enzyme Inhibition Constant Data from BindingDB
Found 1 hit for monomerid = 50471576
TargetCysteinyl leukotriene receptor 1/2(Homo sapiens (Human))
Vrije Universiteit
Curated by ChEMBL
LigandPNGBDBM50471576(CHEMBL11532)
Affinity DataKd:  357nM. Assay description: Displacement of [3H]LTD4 from Cysteinyl leukotriene D4 receptor in guinea pig lung membranes
Ligand InfoPC cidPC sid
In DepthDetails ArticlePubMed