BDBM50471592 CHEMBL12959
SMILES CCCC\C=C(\c1ccc(O)cc1)c1ccc(OCCN(CC)CC)cc1
InChI Key InChIKey=RIMXSFHITCMBCL-OPVMPGTRSA-N
Data  1 IC50
  Tab Delimited (TSV)   2D SDfile   Computed 3D by Vconf -m prep SDfile
Find this compound or compounds like it in BindingDB:
Activity Spreadsheet -- Enzyme Inhibition Constant Data from BindingDB
Found 1 hit for monomerid = 50471592
TargetEstrogen receptor beta(Homo sapiens (Human))
Universit£
Curated by ChEMBL
LigandPNGBDBM50471592(CHEMBL12959)
Affinity DataIC50:  500nM. Assay description: Anti-estrogenicity for 50% inhibition of the MVLN cell luciferase activity due to 0.1 nM E2 (estradiol)
Ligand InfoPC cidPC sid
In DepthDetails ArticlePubMed