BDBM50471608 CHEMBL13167
SMILES [#6]-[#6](-[#6])-[#7](-[#6]-[#6]-[#8]-c1ccc(cc1)-[#6](=[#6]-1/[#6]-[#6]-[#6]-[#6]-[#6]-1)\c1ccc(-[#8]-[#6]-[#6]-[#7](-[#6](-[#6])-[#6])-[#6](-[#6])-[#6])cc1)-[#6](-[#6])-[#6]
InChI Key InChIKey=ONXPHFDXGCTIKL-UHFFFAOYSA-N
Data  1 IC50
  Tab Delimited (TSV)   2D SDfile   Computed 3D by Vconf -m prep SDfile
Find this compound or compounds like it in BindingDB:
Activity Spreadsheet -- Enzyme Inhibition Constant Data from BindingDB
Found 1 hit for monomerid = 50471608
TargetEstrogen receptor beta(Homo sapiens (Human))
Universit£
Curated by ChEMBL
LigandPNGBDBM50471608(CHEMBL13167)
Affinity DataIC50:  2.10E+3nM. Assay description: Anti-estrogenicity for 50% inhibition of the MVLN cell luciferase activity due to 0.1 nM E2 (estradiol)
Ligand InfoPC cidPC sid
In DepthDetails ArticlePubMed