BDBM50472635 CHEMBL74399
SMILES CCN(CC)S(=O)(=O)c1ccc(NC(=O)[C@@](C)(O)C(F)(F)F)c(Cl)c1
InChI Key InChIKey=SRAUODURYYKAAX-CYBMUJFWSA-N
Data  1 IC50
  Tab Delimited (TSV)   2D SDfile   Computed 3D by Vconf -m prep SDfile
Find this compound or compounds like it in BindingDB:
Activity Spreadsheet -- Enzyme Inhibition Constant Data from BindingDB
Found 1 hit for monomerid = 50472635
Target[Pyruvate dehydrogenase (acetyl-transferring)] kinase isozyme 1,/2,/3,/4, mitochondrial(Homo sapiens (Human))
Novartis Institute For Biomedical Research
Curated by ChEMBL
LigandPNGBDBM50472635(CHEMBL74399)
Affinity DataIC50:  61nM. Assay description: Inhibition of porcine pyruvate dehydrogenase kinase (PDHK)in a primary enzymatic assay
Ligand InfoPC cidPC sid
In DepthDetails ArticlePubMed