BDBM50472654 CHEMBL75507
SMILES C[C@@](O)(C(=O)Nc1ccc(cc1Cl)S(=O)(=O)NCCCN1CCCC1=O)C(F)(F)F
InChI Key InChIKey=BDPATPOFNBRCCT-MRXNPFEDSA-N
Data  1 IC50
  Tab Delimited (TSV)   2D SDfile   Computed 3D by Vconf -m prep SDfile
Find this compound or compounds like it in BindingDB:
Activity Spreadsheet -- Enzyme Inhibition Constant Data from BindingDB
Found 1 hit for monomerid = 50472654
Target[Pyruvate dehydrogenase (acetyl-transferring)] kinase isozyme 1,/2,/3,/4, mitochondrial(Homo sapiens (Human))
Novartis Institute For Biomedical Research
Curated by ChEMBL
LigandPNGBDBM50472654(CHEMBL75507)
Affinity DataIC50:  16nM. Assay description: Inhibition of porcine pyruvate dehydrogenase kinase (PDHK)in a primary enzymatic assay
Ligand InfoPC cidPC sid
In DepthDetails ArticlePubMed