BDBM50472826 CHEMBL83727
SMILES C[C@@H]1CN(CCN1S(=O)(=O)c1ccccc1)C(=O)[C@@](C)(O)C(F)(F)F
InChI Key InChIKey=HKGXRAHGCLRHDH-BXUZGUMPSA-N
Data  1 IC50
  Tab Delimited (TSV)   2D SDfile   Computed 3D by Vconf -m prep SDfile
Find this compound or compounds like it in BindingDB:
Activity Spreadsheet -- Enzyme Inhibition Constant Data from BindingDB
Found 1 hit for monomerid = 50472826
Target[Pyruvate dehydrogenase (acetyl-transferring)] kinase isozyme 4, mitochondrial(Rattus norvegicus)
Novartis Institute For Biomedical Research
Curated by ChEMBL
LigandPNGBDBM50472826(CHEMBL83727)
Affinity DataIC50:  37nM. Assay description: Inhibitory activity tested against Pyruvate Dehydrogenase Kinase (PDHK) receptor from rats.
Ligand InfoPC cidPC sid
In DepthDetails ArticlePubMed