BDBM50472916 CHEMBL223221::MEN-11690
SMILES Clc1ccc(C[C@@H]2CNC(=O)CCC(=O)N[C@@H](Cc3c[nH]c4ccccc34)C(=O)N[C@@H](Cc3ccccc3)C(=O)N2)cc1Cl
InChI Key InChIKey=OJSAKYLSCHVDCQ-MGONOCMRSA-N
Data  3 KI
  Tab Delimited (TSV)   2D SDfile   Computed 3D by Vconf -m prep SDfile
Find this compound or compounds like it in BindingDB:
Activity Spreadsheet -- Enzyme Inhibition Constant Data from BindingDB
Found 3 hits for monomerid = 50472916
TargetSubstance-K receptor(Homo sapiens (Human))
Menarini Ricerche
Curated by ChEMBL
LigandPNGBDBM50472916(CHEMBL223221 | MEN-11690)
Affinity DataKi:  0.100nM. Assay description: Inhibitory affinity constant (pKi) against tachykinin receptor 2 (NK-2R) using heterologous competition experiments
Ligand InfoPC cidPC sid
In DepthDetails ArticlePubMed
TargetSubstance-K receptor(Homo sapiens (Human))
Menarini Ricerche
Curated by ChEMBL
LigandPNGBDBM50472916(CHEMBL223221 | MEN-11690)
Affinity DataKi:  0.100nM. Assay description: Displacement of [125I]neurokinin A from human NK2 receptor expressed in CHOK1 cells
Ligand InfoPC cidPC sid
In DepthDetails ArticlePubMed
TargetSubstance-K receptor(Homo sapiens (Human))
Menarini Ricerche
Curated by ChEMBL
LigandPNGBDBM50472916(CHEMBL223221 | MEN-11690)
Affinity DataKi:  0.100nM. Assay description: Binding affinity towards Tachykinin receptor 2
Ligand InfoPC cidPC sid
In DepthDetails ArticlePubMed