BDBM50472917 CHEMBL323884::MEN-11749
SMILES Fc1ccc(C[C@@H]2CNC(=O)CCC(=O)N[C@@H](Cc3c[nH]c4ccccc34)C(=O)N[C@@H](Cc3ccccc3)C(=O)N2)cc1F
InChI Key InChIKey=PQFMPWGVKWEHRQ-MGONOCMRSA-N
Data  2 KI
  Tab Delimited (TSV)   2D SDfile   Computed 3D by Vconf -m prep SDfile
Find this compound or compounds like it in BindingDB:
Activity Spreadsheet -- Enzyme Inhibition Constant Data from BindingDB
Found 2 hits for monomerid = 50472917
TargetSubstance-K receptor(Homo sapiens (Human))
Menarini Ricerche
Curated by ChEMBL
LigandPNGBDBM50472917(CHEMBL323884 | MEN-11749)
Affinity DataKi:  1.60nM. Assay description: Binding affinity towards Tachykinin receptor 2
Ligand InfoPC cidPC sid
In DepthDetails ArticlePubMed
TargetSubstance-K receptor(Homo sapiens (Human))
Menarini Ricerche
Curated by ChEMBL
LigandPNGBDBM50472917(CHEMBL323884 | MEN-11749)
Affinity DataKi:  1.60nM. Assay description: Inhibitory affinity constant (pKi) against tachykinin receptor 2 (NK-2R) using heterologous competition experiments
Ligand InfoPC cidPC sid
In DepthDetails ArticlePubMed