BDBM50474632 CHEMBL327116
SMILES CCS(=O)(=O)Nc1ccc2CCCC(c3c[nH]cn3)c2c1
InChI Key InChIKey=BBMAPNYYKCUOGH-UHFFFAOYSA-N
Data  5 KI
  Tab Delimited (TSV)   2D SDfile   Computed 3D by Vconf -m prep SDfile
Find this compound or compounds like it in BindingDB:
Activity Spreadsheet -- Enzyme Inhibition Constant Data from BindingDB
Found 5 hits for monomerid = 50474632
TargetAlpha-2B adrenergic receptor(NEONATAL RAT)
Abbott Laboratories
Curated by ChEMBL
LigandPNGBDBM50474632(CHEMBL327116)
Affinity DataKi:  22nM. Assay description: In vitro binding affinity towards alpha-2B adrenergic receptor of rat neonatal lung in radioligand binding assay
Ligand InfoPC cidPC sid
In DepthDetails ArticlePubMed
TargetAlpha-2A adrenergic receptor(Homo sapiens (Human))
Abbott Laboratories
Curated by ChEMBL
LigandPNGBDBM50474632(CHEMBL327116)
Affinity DataKi:  23nM. Assay description: In vitro binding affinity towards alpha-2A adrenergic receptor of human clone in radioligand binding assay
Ligand InfoPC cidPC sid
In DepthDetails ArticlePubMed
TargetAlpha-1D adrenergic receptor(Rattus norvegicus (Rat))
Abbott Laboratories
Curated by ChEMBL
LigandPNGBDBM50474632(CHEMBL327116)
Affinity DataKi:  339nM. Assay description: In vitro binding affinity towards alpha-1D adrenergic receptor of rat clone in radioligand binding assay
Ligand InfoPC cidPC sid
In DepthDetails ArticlePubMed
TargetAlpha-1B adrenergic receptor(HAMSTER)
Abbott Laboratories
Curated by ChEMBL
LigandPNGBDBM50474632(CHEMBL327116)
Affinity DataKi:  1.35E+3nM. Assay description: In vitro binding affinity towards alpha-1B adrenergic receptor of hamster clone in radioligand binding assay
Ligand InfoPC cidPC sid
In DepthDetails ArticlePubMed
TargetAlpha-1A adrenergic receptor(CALF)
Abbott Laboratories
Curated by ChEMBL
LigandPNGBDBM50474632(CHEMBL327116)
Affinity DataKi:  2.04E+3nM. Assay description: In vitro binding affinity towards alpha-1A adrenergic receptor of bovine clone in radioligand binding assay
Ligand InfoPC cidPC sid
In DepthDetails ArticlePubMed