BDBM50476231 CHEMBL225588
SMILES O=C(CN1CCC(CC1)N1CCOCC1)N[C@@H]1CC(=O)N[C@@H](Cc2c[nH]c3ccccc23)C(=O)N[C@@H](Cc2ccccc2)C(=O)N[C@H](Cc2ccccc2)CNC1=O
InChI Key InChIKey=FKXMTDOSYPOSDS-QJMCPCMJSA-N
Data  3 KI
  Tab Delimited (TSV)   2D SDfile   Computed 3D by Vconf -m prep SDfile
Find this compound or compounds like it in BindingDB:
Activity Spreadsheet -- Enzyme Inhibition Constant Data from BindingDB
Found 3 hits for monomerid = 50476231
TargetSubstance-K receptor(Homo sapiens (Human))
Menarini Ricerche
Curated by ChEMBL
LigandPNGBDBM50476231(CHEMBL225588)
Affinity DataKi:  0.158nM. Assay description: Displacement of [125I]neurokinin A from human NK2 receptor expressed in CHOK1 cells
Ligand InfoPC cidPC sid
In DepthDetails ArticlePubMed
TargetSubstance-P receptor(Homo sapiens (Human))
Menarini Ricerche
Curated by ChEMBL
LigandPNGBDBM50476231(CHEMBL225588)
Affinity DataKi:  126nM. Assay description: Displacement of [3H][Sar9]SP sulfone from human NK1 receptor expressed in U373MG cells
Ligand InfoPC cidPC sid
In DepthDetails ArticlePubMed
TargetNeuromedin-K receptor(Homo sapiens (Human))
Menarini Ricerche
Curated by ChEMBL
LigandPNGBDBM50476231(CHEMBL225588)
Affinity DataKi:  1.26E+3nM. Assay description: Displacement of [125I][MePhe7]NKB from human NK3 receptor expressed in CHOK1 cells
Ligand InfoPC cidPC sid
In DepthDetails ArticlePubMed