BDBM50476748 CHEMBL395972
SMILES FC(F)(F)c1ccc2cc(sc2c1)C(=O)NC1(CCCC1)C(=O)N[C@H](Cc1ccccc1)C(=O)NCC1CCN(CC2CCOCC2)CC1
InChI Key InChIKey=APGKRIOUNGEFML-SSEXGKCCSA-N
Data  1 KI
  Tab Delimited (TSV)   2D SDfile   Computed 3D by Vconf -m prep SDfile
Find this compound or compounds like it in BindingDB:
Activity Spreadsheet -- Enzyme Inhibition Constant Data from BindingDB
Found 1 hit for monomerid = 50476748
TargetSubstance-K receptor(Homo sapiens (Human))
Menarini Ricerche
Curated by ChEMBL
LigandPNGBDBM50476748(CHEMBL395972)
Affinity DataKi:  0.0603nM. Assay description: Displacement of [125I]neurokinin A from human recombinant NK2 receptor
Ligand InfoPC cidPC sid
In DepthDetails ArticlePubMed