BDBM50478160 CHEMBL260767
SMILES CNC(=O)Cn1c2ccccc2n(C2CCN(CC[C@H](Oc3cc(OC)ccc3C)C(C)C)CC2)c1=O
InChI Key InChIKey=OUDYUUVZVNMOPP-SANMLTNESA-N
Data  2 KI
  Tab Delimited (TSV)   2D SDfile   Computed 3D by Vconf -m prep SDfile
Find this compound or compounds like it in BindingDB:
Activity Spreadsheet -- Enzyme Inhibition Constant Data from BindingDB
Found 2 hits for monomerid = 50478160
TargetNociceptin receptor(Homo sapiens (Human))
Organon Laboratories
Curated by ChEMBL
LigandPNGBDBM50478160(CHEMBL260767)
Affinity DataKi:  0.501nM. Assay description: Displacement of [3H]nociceptin from human NOP receptor expressed in CHO cells
Ligand InfoPC cidPC sid
In DepthDetails ArticlePubMed
TargetMu-type opioid receptor(Homo sapiens (Human))
Organon Laboratories
Curated by ChEMBL
LigandPNGBDBM50478160(CHEMBL260767)
Affinity DataKi:  54nM. Assay description: Displacement of [3H]Diprenorphine from human mu opioid receptor expressed in CHO cells
Ligand InfoPC cidPC sid
In DepthDetails ArticlePubMed