BDBM504783 US11066396, Example 198::methyl 4- {({5-[5- (trifluoro- methyl)- 1,2,4-oxa- diazol-3- yl]pyridin- 2-yl} methyl)[3- (trifluoro- methyl) phenyl] carbamoyl} piperidine-
SMILES COC(=O)N1CCC(CC1)C(=O)N(Cc1ccc(cn1)-c1noc(n1)C(F)(F)F)c1cccc(c1)C(F)(F)F
InChI Key InChIKey=FRKAYDRGUNOSLX-UHFFFAOYSA-N
Data  4 IC50
  Tab Delimited (TSV)   2D SDfile   Computed 3D by Vconf -m prep SDfile
Find this compound or compounds like it in BindingDB:
Activity Spreadsheet -- Enzyme Inhibition Constant Data from BindingDB
Found 4 hits for monomerid = 504783
TargetHistone deacetylase 6(Homo sapiens (Human))
Merck Sharp & Dohme
US Patent
LigandPNGBDBM504783(US11066396, Example 198 | methyl 4- {({5-[5- (trif...)
Affinity DataIC50:  21nM. Assay description: HDAC1 and 6 reagents: FLAG-tagged HDACs 1 and 6 were prepared in-house by protein expression in HEK293F cells followed by anti-FLAG affinity purifica...
Ligand InfoPC cidPC sid
In DepthDetails US Patent
TargetHistone deacetylase 8(Homo sapiens (Human))
Merck Sharp & Dohme
US Patent
LigandPNGBDBM504783(US11066396, Example 198 | methyl 4- {({5-[5- (trif...)
Affinity DataIC50:  1.30E+3nM. Assay description: HDAC8 reagents: HDAC8 was purchased from Enzo Life Sciences [catalog #BML-SE145]. Assays were performed with buffer containing 20 mM HEPES, pH 8.0 [B...
Ligand InfoPC cidPC sid
In DepthDetails US Patent
TargetHistone deacetylase 5(Homo sapiens (Human))
Merck Sharp & Dohme
US Patent
LigandPNGBDBM504783(US11066396, Example 198 | methyl 4- {({5-[5- (trif...)
Affinity DataIC50:  650nM. Assay description: HDAC5 reagents: N-terminal GST tagged HDAC5 was purchased from BPS Bioscience [catalog #50045]. Assays were performed with buffer containing 20 mM HE...
Ligand InfoPC cidPC sid
In DepthDetails US Patent
TargetHistone deacetylase 1(Homo sapiens (Human))
Merck Sharp & Dohme
US Patent
LigandPNGBDBM504783(US11066396, Example 198 | methyl 4- {({5-[5- (trif...)
Affinity DataIC50:  480nM. Assay description: HDAC1 and 6 reagents: FLAG-tagged HDACs 1 and 6 were prepared in-house by protein expression in HEK293F cells followed by anti-FLAG affinity purifica...
Ligand InfoPC cidPC sid
In DepthDetails US Patent