BDBM50478514 Fagaronine::Fagaronine Chloride
SMILES [Cl-].COc1cc2c(ccc3c4cc(OC)c(OC)cc4c[n+](C)c23)cc1O
InChI Key InChIKey=OOKZVPUCASIEBL-UHFFFAOYSA-O
Data  5 IC50
  Tab Delimited (TSV)   2D SDfile   Computed 3D by Vconf -m prep SDfile
Find this compound or compounds like it in BindingDB:
Activity Spreadsheet -- Enzyme Inhibition Constant Data from BindingDB
Found 5 hits for monomerid = 50478514
TargetReverse transcriptase(Human immunodeficiency virus 1)
Mahidol University
Curated by ChEMBL
LigandPNGBDBM50478514(Fagaronine | Fagaronine Chloride)
Affinity DataIC50:  2.65E+4nM. Assay description: Inhibition of HIV-1 reverse transcriptase assessed as decrease in incorporation of [3H]TTP into polyA template
Ligand InfoPC cidPC sid
In DepthDetails ArticlePubMed
TargetReverse transcriptase(Human immunodeficiency virus 1)
Mahidol University
Curated by ChEMBL
LigandPNGBDBM50478514(Fagaronine | Fagaronine Chloride)
Affinity DataIC50:  1.30E+4nM. Assay description: Inhibition of HIV1 reverse transcriptase
Ligand InfoPC cidPC sid
In DepthDetails ArticlePubMed
TargetDNA ligase 1(Homo sapiens (Human))
University Of Allahabad
Curated by ChEMBL
LigandPNGBDBM50478514(Fagaronine | Fagaronine Chloride)
Affinity DataIC50:  2.59E+4nM. Assay description: Inhibition of human DNA ligase 1 using 52-mer DNA/25-mer DNA/27-mer DNA as substrate by fluorescence assay
Ligand InfoPC cidPC sid
In DepthDetails ArticlePubMed
TargetReverse transcriptase(Human immunodeficiency virus 1)
Mahidol University
Curated by ChEMBL
LigandPNGBDBM50478514(Fagaronine | Fagaronine Chloride)
Affinity DataIC50:  4.66E+4nM. Assay description: Inhibition of HIV1 RT
Ligand InfoPC cidPC sid
In DepthDetails ArticlePubMed
TargetReverse transcriptase(Human immunodeficiency virus 1)
Mahidol University
Curated by ChEMBL
LigandPNGBDBM50478514(Fagaronine | Fagaronine Chloride)
Affinity DataIC50:  2.59E+4nM. Assay description: Inhibition of HIV1 RT using poly A oligo(dT) template primer
Ligand InfoPC cidPC sid
In DepthDetails ArticlePubMed