BDBM50480795 3-Nitroporpionic Acid::3-Nitropropionate::3-Nitropropionic Acid::CHEBI:16348::CHEMBL451226
SMILES OC(=O)CC[N+]([O-])=O
InChI Key InChIKey=WBLZUCOIBUDNBV-UHFFFAOYSA-N
Data  4 IC50
PDB links: 8 PDB IDs match this monomer.
  Tab Delimited (TSV)   2D SDfile   Computed 3D by Vconf -m prep SDfile
Find this compound or compounds like it in BindingDB:
Activity Spreadsheet -- Enzyme Inhibition Constant Data from BindingDB
Found 4 hits for monomerid = 50480795
TargetIsocitrate lyase(Candida albicans)
Seoul National University
Curated by ChEMBL
LigandPNGBDBM50480795(3-Nitroporpionic Acid | 3-Nitropropionate | 3-Nitr...)
Affinity DataIC50:  1.73E+4nM. Assay description: Inhibition of Candida albicans ATCC 10231 isocitrate lyase
In DepthDetails ArticlePubMed
TargetIsocitrate lyase(Candida albicans)
Seoul National University
Curated by ChEMBL
LigandPNGBDBM50480795(3-Nitroporpionic Acid | 3-Nitropropionate | 3-Nitr...)
Affinity DataIC50:  1.70E+4nM. Assay description: Inhibition of Candida albicans ICL assessed as reduction in glyoxylate phenylhydrazone formation using M threo-DL(+)isocitrate as substrate incubated...
In DepthDetails ArticlePubMed
TargetIsocitrate lyase(Candida albicans)
Seoul National University
Curated by ChEMBL
LigandPNGBDBM50480795(3-Nitroporpionic Acid | 3-Nitropropionate | 3-Nitr...)
Affinity DataIC50:  3.52E+4nM. Assay description: Inhibition of Candida albicans ICL assessed as formation of glyoxylate phenylhydrazone by spectrophotometry
In DepthDetails ArticlePubMed
TargetIsocitrate lyase(Magnaporthe oryzae (strain 70-15 / FGSC 8958) (Ric...)
Seoul National University
Curated by ChEMBL
LigandPNGBDBM50480795(3-Nitroporpionic Acid | 3-Nitropropionate | 3-Nitr...)
Affinity DataIC50:  5.12E+4nM. Assay description: Inhibition of Magnaporthe grisea isocitrate lyase
In DepthDetails ArticlePubMed