BDBM50481584 CHEMBL589988::GRL-0355
SMILES [H][C@@]12CCO[C@]1([H])OC[C@@H]2OC(=O)N[C@@H](Cc1ccccc1)[C@H](O)C(=O)N1CSC(C)(C)[C@H]1C(=O)NCc1ccccc1C
InChI Key InChIKey=FAPAYWLCASVUFX-QEPABPODSA-N
Data  1 KI
  Tab Delimited (TSV)   2D SDfile   Computed 3D by Vconf -m prep SDfile
Find this compound or compounds like it in BindingDB:
Activity Spreadsheet -- Enzyme Inhibition Constant Data from BindingDB
Found 1 hit for monomerid = 50481584
TargetProtease(Human immunodeficiency virus 1 (HIV-1))
Purdue University
Curated by ChEMBL
LigandPNGBDBM50481584(CHEMBL589988 | GRL-0355)
Affinity DataKi:  0.00520nM. Assay description: Inhibition of HIV1 protease
Ligand InfoPC cidPC sid
In DepthDetails ArticlePubMed