BDBM50482688 CHEMBL387958
SMILES Clc1ccc(N\C=C(/C(=O)NC2CCCC2)C(=O)c2ccccc2Cl)cc1
InChI Key InChIKey=RSQLQLXLMFIJEH-AQTBWJFISA-N
Data  1 IC50
  Tab Delimited (TSV)   2D SDfile   Computed 3D by Vconf -m prep SDfile
Find this compound or compounds like it in BindingDB:
Activity Spreadsheet -- Enzyme Inhibition Constant Data from BindingDB
Found 1 hit for monomerid = 50482688
TargetGamma-aminobutyric acid receptor subunit alpha-1/beta-2/gamma-2(Rattus norvegicus (Rat))
Wuhan Institute Of Technology
Curated by ChEMBL
LigandPNGBDBM50482688(CHEMBL387958)
Affinity DataIC50:  30nM. Assay description: Inhibition of rat GABA alpha-1-beta-2-gamma-2 receptor
Ligand InfoPC cidPC sid
In DepthDetails ArticlePubMed