BDBM50482694 CHEMBL229535
SMILES Clc1ccc(N\C=C(/C(=O)NC2CC2)C(=O)c2ccccc2Cl)cc1
InChI Key InChIKey=OIYPVGAAAPRMOJ-WJDWOHSUSA-N
Data  1 IC50
  Tab Delimited (TSV)   2D SDfile   Computed 3D by Vconf -m prep SDfile
Find this compound or compounds like it in BindingDB:
Activity Spreadsheet -- Enzyme Inhibition Constant Data from BindingDB
Found 1 hit for monomerid = 50482694
TargetGamma-aminobutyric acid receptor subunit alpha-1/beta-2/gamma-2(Rattus norvegicus (Rat))
Wuhan Institute Of Technology
Curated by ChEMBL
LigandPNGBDBM50482694(CHEMBL229535)
Affinity DataIC50:  30nM. Assay description: Inhibition of rat GABA alpha-1-beta-2-gamma-2 receptor
Ligand InfoPC cidPC sid
In DepthDetails ArticlePubMed