BDBM50483614 CHEMBL1760910
SMILES ONC(=O)CCCC1CCN(CC1)S(=O)(=O)Cc1ccccc1
InChI Key InChIKey=NBRPFYMLOZGWRR-UHFFFAOYSA-N
Data  2 IC50
  Tab Delimited (TSV)   2D SDfile   Computed 3D by Vconf -m prep SDfile
Find this compound or compounds like it in BindingDB:
Activity Spreadsheet -- Enzyme Inhibition Constant Data from BindingDB
Found 2 hits for monomerid = 50483614
TargetHistone deacetylase(Homo sapiens (Human))
Menarini Ricerche Pomezia
Curated by ChEMBL
LigandPNGBDBM50483614(CHEMBL1760910)
Affinity DataIC50:  840nM. Assay description: Inhibition of HDAC in human HeLa cell extract assessed as fluorophore release by fluorescence spectrophotometry
Ligand InfoPC cidPC sid
In DepthDetails ArticlePubMed
TargetHistone deacetylase(Homo sapiens (Human))
Menarini Ricerche Pomezia
Curated by ChEMBL
LigandPNGBDBM50483614(CHEMBL1760910)
Affinity DataIC50:  840nM. Assay description: Inhibition of HDAC in human HeLa cells by fluorescent activity assay
Ligand InfoPC cidPC sid
In DepthDetails ArticlePubMed