BDBM50483619 CHEMBL1760913
SMILES ONC(=O)CCCC1CCN(CC1)C(=O)Cc1ccccc1
InChI Key InChIKey=BTBHLVARBASTIO-UHFFFAOYSA-N
Data  1 IC50
  Tab Delimited (TSV)   2D SDfile   Computed 3D by Vconf -m prep SDfile
Find this compound or compounds like it in BindingDB:
Activity Spreadsheet -- Enzyme Inhibition Constant Data from BindingDB
Found 1 hit for monomerid = 50483619
TargetHistone deacetylase(Homo sapiens (Human))
Menarini Ricerche Pomezia
Curated by ChEMBL
LigandPNGBDBM50483619(CHEMBL1760913)
Affinity DataIC50:  260nM. Assay description: Inhibition of HDAC in human HeLa cells by fluorescent activity assay
Ligand InfoPC cidPC sid
In DepthDetails ArticlePubMed