BDBM50484946 (18F)AV-45::18F-AV-45::AV-45 F-18::Amyvid::CHEBI:66880::Florbetapir (18f)::Florbetapir F 18
SMILES CNc1ccc(\C=C\c2ccc(OCCOCCOCC[18F])nc2)cc1
InChI Key InChIKey=YNDIAUKFXKEXSV-NSCUHMNNSA-N
Data  5 KI
  Tab Delimited (TSV)   2D SDfile   Computed 3D by Vconf -m prep SDfile
Find this compound or compounds like it in BindingDB:
Activity Spreadsheet -- Enzyme Inhibition Constant Data from BindingDB
Found 5 hits for monomerid = 50484946
TargetAmyloid-beta precursor protein(Homo sapiens (Human))
University Of Pennsylvania
Curated by ChEMBL
LigandPNGBDBM50484946((18F)AV-45 | 18F-AV-45 | AV-45 F-18 | Amyvid | CHE...)
Affinity DataKi:  2.90nM. Assay description: Binding affinity to human amyloid beta plaque
In DepthDetails ArticlePubMed
TargetAmyloid-beta precursor protein(Homo sapiens (Human))
University Of Pennsylvania
Curated by ChEMBL
LigandPNGBDBM50484946((18F)AV-45 | 18F-AV-45 | AV-45 F-18 | Amyvid | CHE...)
Affinity DataKi:  2.90nM. Assay description: Binding affinity to amyloid beta aggregates in postmortem human Alzheimer's disease brain homogenates after 2 hrs by gamma counting
In DepthDetails ArticlePubMed
TargetAmyloid-beta precursor protein(Homo sapiens (Human))
University Of Pennsylvania
Curated by ChEMBL
LigandPNGBDBM50484946((18F)AV-45 | 18F-AV-45 | AV-45 F-18 | Amyvid | CHE...)
Affinity DataKi:  2.90nM. Assay description: Binding affinity to amyloid beta (1-42) aggregates in human Alzheimer's disease brain sections
In DepthDetails ArticlePubMed
TargetAmyloid-beta precursor protein(Homo sapiens (Human))
University Of Pennsylvania
Curated by ChEMBL
LigandPNGBDBM50484946((18F)AV-45 | 18F-AV-45 | AV-45 F-18 | Amyvid | CHE...)
Affinity DataKi:  2.90nM. Assay description: Displacement of [125I]IMPY from amyloid beta in brain homogenate of Alzheimer's disease patient after 2 hrs by gamma counting analysis
In DepthDetails ArticlePubMed
TargetAmyloid-beta precursor protein(Homo sapiens (Human))
University Of Pennsylvania
Curated by ChEMBL
LigandPNGBDBM50484946((18F)AV-45 | 18F-AV-45 | AV-45 F-18 | Amyvid | CHE...)
Affinity DataKi:  2.90nM. Assay description: Displacement of [18F]-amyvid from amyloid-beta aggregates in alzheimer's disease patient brain homogenates after 1 hr
In DepthDetails ArticlePubMed