BDBM50485306 CHEMBL2048303
SMILES Oc1ccc2nc(sc2c1)-c1ccc(NCCCF)nc1
InChI Key InChIKey=IEWOVXGSFQYGIV-UHFFFAOYSA-N
Data  1 IC50
  Tab Delimited (TSV)   2D SDfile   Computed 3D by Vconf -m prep SDfile
Find this compound or compounds like it in BindingDB:
Activity Spreadsheet -- Enzyme Inhibition Constant Data from BindingDB
Found 1 hit for monomerid = 50485306
TargetAmyloid-beta precursor protein(Homo sapiens (Human))
Astrazeneca
Curated by ChEMBL
LigandPNGBDBM50485306(CHEMBL2048303)
Affinity DataIC50:  66nM. Assay description: Displacement of [3H]AZD2184 from human amyloid beta(1 to 40)
Ligand InfoPC cidPC sid
In DepthDetails ArticlePubMed