BDBM50485308 CHEMBL2048310
SMILES CNc1ncc(cc1F)-c1cc2cc(O)ccc2o1
InChI Key InChIKey=PQCXZHFSSVHSPI-UHFFFAOYSA-N
Data  1 IC50
  Tab Delimited (TSV)   2D SDfile   Computed 3D by Vconf -m prep SDfile
Find this compound or compounds like it in BindingDB:
Activity Spreadsheet -- Enzyme Inhibition Constant Data from BindingDB
Found 1 hit for monomerid = 50485308
TargetAmyloid-beta precursor protein(Homo sapiens (Human))
Astrazeneca
Curated by ChEMBL
LigandPNGBDBM50485308(CHEMBL2048310)
Affinity DataIC50:  30nM. Assay description: Displacement of [3H]AZD2184 from human amyloid beta(1 to 40)
Ligand InfoPC cidPC sid
In DepthDetails ArticlePubMed