BDBM50485468 CHEMBL1863039::DNDI1467766
SMILES NC(=O)c1cccc(c1)C(O)(c1cccnc1)c1ccc(Cl)cc1F
InChI Key InChIKey=CLUBDPXPDURZBY-UHFFFAOYSA-N
Data  1 IC50
  Tab Delimited (TSV)   2D SDfile   Computed 3D by Vconf -m prep SDfile
Find this compound or compounds like it in BindingDB:
Activity Spreadsheet -- Enzyme Inhibition Constant Data from BindingDB
Found 1 hit for monomerid = 50485468
TargetCytochrome P450 3A4/3A5(Homo sapiens (Human))
Epichem
Curated by ChEMBL
LigandPNGBDBM50485468(CHEMBL1863039 | DNDI1467766)
Affinity DataIC50:  3.90E+3nM. Assay description: Inhibition of CYP3A4/5 in human liver microsomes
Ligand InfoPC cidPC sid
In DepthDetails ArticlePubMed