BDBM50485561 CHEBI:355510::Cefotiam::Ceradon::J01DC07
SMILES [H][C@]12SCC(CSc3nnnn3CCN(C)C)=C(N1C(=O)[C@H]2NC(=O)Cc1csc(N)n1)C(O)=O
InChI Key InChIKey=QYQDKDWGWDOFFU-IUODEOHRSA-N
Data  1 IC50
  Tab Delimited (TSV)   2D SDfile   Computed 3D by Vconf -m prep SDfile
Find this compound or compounds like it in BindingDB:
Activity Spreadsheet -- Enzyme Inhibition Constant Data from BindingDB
Found 1 hit for monomerid = 50485561
TargetSolute carrier family 22 member 6(Rattus norvegicus)
Kyoto University Hospital
Curated by ChEMBL
LigandPNGBDBM50485561(CHEBI:355510 | Cefotiam | Ceradon | J01DC07)
Affinity DataIC50:  7.18E+5nM. Assay description: TP_TRANSPORTER: inhibition of PAH uptake in Xenopus laevis oocytes
In DepthDetails ArticlePubMed