BDBM50485632 CHEBI:17521::Quinic Acid::Rel-Quinic Acid
SMILES O[C@@H]1C[C@@](O)(C[C@@H](O)[C@H]1O)C(O)=O
InChI Key InChIKey=AAWZDTNXLSGCEK-WYWMIBKRSA-N
Data  1 IC50
PDB links: 4 PDB IDs match this monomer.
  Tab Delimited (TSV)   2D SDfile   Computed 3D by Vconf -m prep SDfile
Find this compound or compounds like it in BindingDB:
Activity Spreadsheet -- Enzyme Inhibition Constant Data from BindingDB
Found 1 hit for monomerid = 50485632
TargetAmyloid-beta precursor protein(Homo sapiens (Human))
University Of Tsukuba
Curated by ChEMBL
LigandPNGBDBM50485632(CHEBI:17521 | Quinic Acid | Rel-Quinic Acid)
Affinity DataIC50: >1.00E+5nM. Assay description: Inhibition of human amyloid beta (1 to 42) aggregation after 24 hrs by thioflavin-T fluorescence assay
In DepthDetails ArticlePubMed