BDBM50485823 bromoderivative
SMILES Nc1ncnc2n(CCc3ccccc3Br)c(Sc3cc4OCOc4cc3Br)nc12
InChI Key InChIKey=PVFOHMXILQEIHX-UHFFFAOYSA-N
Data  2 IC50
  Tab Delimited (TSV)   2D SDfile   Computed 3D by Vconf -m prep SDfile
Find this compound or compounds like it in BindingDB:
Activity Spreadsheet -- Enzyme Inhibition Constant Data from BindingDB
Found 2 hits for monomerid = 50485823
TargetHeat shock protein HSP 90-alpha/90-beta(Homo sapiens (Human))
Myrexis
Curated by ChEMBL
LigandPNGBDBM50485823(bromoderivative)
Affinity DataIC50:  30nM. Assay description: Inhibition of human HSP90 using BODIPY labelled geldanamycin as substrate by fluorescence polarization assay
Ligand InfoPC cidPC sid
In DepthDetails ArticlePubMed
TargetHeat shock protein HSP 90-alpha/90-beta(Homo sapiens (Human))
Myrexis
Curated by ChEMBL
LigandPNGBDBM50485823(bromoderivative)
Affinity DataIC50:  50nM. Assay description: Inhibition of human HSP90 in HCT116 cells expressing Her2 gene assessed as degradation of Her2 after 4 hrs by luciferase reporter gene assay
Ligand InfoPC cidPC sid
In DepthDetails ArticlePubMed