BDBM50487041 CHEMBL2253233
SMILES CCCn1nc(C)c2cccc(Oc3nc(OC)cc(OC)n3)c2c1=O
InChI Key InChIKey=JARANVSIBLDFLV-UHFFFAOYSA-N
Data  1 KI
  Tab Delimited (TSV)   2D SDfile   Computed 3D by Vconf -m prep SDfile
Find this compound or compounds like it in BindingDB:
Activity Spreadsheet -- Enzyme Inhibition Constant Data from BindingDB
Found 1 hit for monomerid = 50487041
TargetAcetolactate synthase, chloroplastic(Arabidopsis thaliana)
Central China Normal University
Curated by ChEMBL
LigandPNGBDBM50487041(CHEMBL2253233)
Affinity DataKi:  1.70E+6nM. Assay description: Inhibition of wild type Arabidopsis thaliana acetohydroxyacid synthase
Ligand InfoPC cidPC sid
In DepthDetails ArticlePubMed