BDBM50488757 CHEMBL2296698
SMILES N\C(=N\O)c1cccc(CN2C(CCc3ccc(F)c(F)c3)C(O)C(Cc3ccc(F)c(F)c3)N(Cc3cccc(c3)C(\N)=N/O)C2=O)c1
InChI Key InChIKey=JOOIRGLUJVFIDO-UHFFFAOYSA-N
Data  1 KI
  Tab Delimited (TSV)   2D SDfile   Computed 3D by Vconf -m prep SDfile
Find this compound or compounds like it in BindingDB:
Activity Spreadsheet -- Enzyme Inhibition Constant Data from BindingDB
Found 1 hit for monomerid = 50488757
TargetProtease(Human immunodeficiency virus 1 (HIV-1))TBA
LigandPNGBDBM50488757(CHEMBL2296698)
Affinity DataKi:  0.0100nM. Assay description: Inhibition of Human immunodeficiency virus 1 protease
Ligand InfoPC cidPC sid
In DepthDetails Article