BDBM50489113 CHEMBL2296610
SMILES CC(C)(NC(=O)[C@H](Cc1ccc(O)cc1)NC(=O)[C@H](CCC(O)=O)NC(=O)OCC1c2ccccc2-c2ccccc12)C(=O)N[C@@H](CC(N)=O)C(O)=O
InChI Key InChIKey=XLHAWQAGMMFFQO-AWCRTANDSA-N
Data  1 Kd
  Tab Delimited (TSV)   2D SDfile   Computed 3D by Vconf -m prep SDfile
Find this compound or compounds like it in BindingDB:
Activity Spreadsheet -- Enzyme Inhibition Constant Data from BindingDB
Found 1 hit for monomerid = 50489113
TargetGrowth factor receptor-bound protein 2(Homo sapiens (Human))TBA
LigandPNGBDBM50489113(CHEMBL2296610)
Affinity DataKd:  6.30nM. Assay description: Binding affinity to Grb2-SH2 (unknown origin) by surface plasmon resonance analysis
Ligand InfoPC cidPC sid
In DepthDetails Article