BDBM50490745 CHEMBL1863273::DNDI1338491
SMILES CS(=O)(=O)N1CCN(CC1)C(c1ccc(Cl)cc1)c1cccnc1
InChI Key InChIKey=PAXYFQVPOZBQCN-UHFFFAOYSA-N
Data  1 IC50
  Tab Delimited (TSV)   2D SDfile   Computed 3D by Vconf -m prep SDfile
Find this compound or compounds like it in BindingDB:
Activity Spreadsheet -- Enzyme Inhibition Constant Data from BindingDB
Found 1 hit for monomerid = 50490745
TargetCytochrome P450 3A4/3A5(Homo sapiens (Human))
Epichem
Curated by ChEMBL
LigandPNGBDBM50490745(CHEMBL1863273 | DNDI1338491)
Affinity DataIC50:  3.60E+3nM. Assay description: Inhibition of CYP3A4/5 in human liver microsomes assessed as reduction in testosterone-beta-hydroxylation
Ligand InfoPC cidPC sid
In DepthDetails ArticlePubMed