BDBM50492043 CHEMBL2391047
SMILES Cc1c(C=O)cc(-c2ccc(cc2)S(C)(=O)=O)n1-c1cccc(F)c1
InChI Key InChIKey=VTUBEKVHUQCUPE-UHFFFAOYSA-N
Data  2 IC50
  Tab Delimited (TSV)   2D SDfile   Computed 3D by Vconf -m prep SDfile
Find this compound or compounds like it in BindingDB:
Activity Spreadsheet -- Enzyme Inhibition Constant Data from BindingDB
Found 2 hits for monomerid = 50492043
TargetProstaglandin G/H synthase 1(Mus musculus)
Universit£
Curated by ChEMBL
LigandPNGBDBM50492043(CHEMBL2391047)
Affinity DataIC50: >1.00E+4nM. Assay description: Inhibition of COX1 in mouse J774 cells using arachidonic acid as substrate assessed as inhibition of PGE2 production incubated for 15 mins prior to s...
Ligand InfoPC cidPC sid
In DepthDetails ArticlePubMed
TargetProstaglandin G/H synthase 2(Mus musculus (Mouse))
Universit£
Curated by ChEMBL
LigandPNGBDBM50492043(CHEMBL2391047)
Affinity DataIC50:  9.5nM. Assay description: Inhibition of COX2 in mouse J774 cells assessed as inhibition of LPS-induced PGE2 production by radioimmunoassay
Ligand InfoPC cidPC sid
In DepthDetails ArticlePubMed