BDBM50493642 CHEMBL2437452
SMILES OC(=O)C(F)(F)F.CN1C(=O)C[C@@](C)(CCc2ccccc2)N=C1N
InChI Key InChIKey=ZPTMMNXKBDAEFJ-PFEQFJNWSA-N
Data  1 IC50  1 Kd
  Tab Delimited (TSV)   2D SDfile   Computed 3D by Vconf -m prep SDfile
Find this compound or compounds like it in BindingDB:
Activity Spreadsheet -- Enzyme Inhibition Constant Data from BindingDB
Found 2 hits for monomerid = 50493642
TargetBeta-secretase 1(Homo sapiens (Human))
Hokkaido University
Curated by ChEMBL
LigandPNGBDBM50493642(CHEMBL2437452)
Affinity DataKd:  3.66E+4nM. Assay description: Binding affinity to human recombinant BACE1 expressed in Escherichia coli BL21(DE3) by isothermal titration calorimetry assay
Ligand InfoPC cidPC sid
In DepthDetails ArticlePubMed
TargetBeta-secretase 1(Homo sapiens (Human))
Hokkaido University
Curated by ChEMBL
LigandPNGBDBM50493642(CHEMBL2437452)
Affinity DataIC50:  4.14E+4nM. Assay description: Inhibition of human recombinant BACE1 expressed in Escherichia coli BL21(DE3) using Biotin-XSEVNLDAEFRHDSGC-Eu as substrate after 1 hr by fluorescenc...
Ligand InfoPC cidPC sid
In DepthDetails ArticlePubMed