BDBM50493643 CHEMBL2437442
SMILES OC(=O)C(F)(F)F.[H][C@]1(C[C@H]1c1cccc(c1)-c1ccccc1)[C@]1(C)CC(=O)N(C)C(N)=N1
InChI Key InChIKey=UVANSSGIUHVDSB-GGTCQWKLSA-N
Data  1 IC50
  Tab Delimited (TSV)   2D SDfile   Computed 3D by Vconf -m prep SDfile
Find this compound or compounds like it in BindingDB:
Activity Spreadsheet -- Enzyme Inhibition Constant Data from BindingDB
Found 1 hit for monomerid = 50493643
TargetBeta-secretase 1(Homo sapiens (Human))
Hokkaido University
Curated by ChEMBL
LigandPNGBDBM50493643(CHEMBL2437442)
Affinity DataIC50:  9.30E+3nM. Assay description: Inhibition of human recombinant BACE1 expressed in Escherichia coli BL21(DE3) using Biotin-XSEVNLDAEFRHDSGC-Eu as substrate after 1 hr by fluorescenc...
Ligand InfoPC cidPC sid
In DepthDetails ArticlePubMed